Target
Proto-oncogene tyrosine-protein kinase Src
Ligand
BDBM345140
Substrate
Meas. Tech.
Enzyme Inhibition
IC50
10.00±n/a nM
Citation
 Fyfe, MCMeghani, PThom, SM Kinase inhibitors US Patent  US9783556 Publication Date 10/10/2017 
Target
Name:
Proto-oncogene tyrosine-protein kinase Src
Synonyms:
Calmodulin/Proto-oncogene tyrosine-protein kinase Src Proto-oncogene c-Src SRC SRC_HUMAN V-src sarcoma (Schmidt-Ruppin A-2) viral oncogene homolog (avian) p60-Src | pp60c-src
Type:
Protein
Mol. Mass.:
59838.60
Organism:
Homo sapiens (Human)
Description:
P12931
Residue:
536
  
Inhibitor
Name:
BDBM345140
Synonyms:
3-Methoxy-N-(2-morpholinoethyl)-5-((4-((4-(3-(1-(p-tolyl)-3-(trimethylsilyl)-1H-pyrazol-5-yl)ureido)naphthalen-1-yl)oxy)pyrimidin-2-yl)amino)benzamide | US9783556, Example 12
Type:
Small organic molecule
Emp. Form.:
C42H47N9O5Si
Mol. Mass.:
785.9654
SMILES:
COc1cc(Nc2nccc(Oc3ccc(NC(=O)Nc4cc(nn4-c4ccc(C)cc4)[Si](C)(C)C)c4ccccc34)n2)cc(c1)C(=O)NCCN1CCOCC1
: