Target
Tyrosine-protein kinase SYK
Ligand
BDBM345141
Substrate
Meas. Tech.
Enzyme Inhibition
IC50
106±n/a nM
Citation
 Fyfe, MCMeghani, PThom, SM Kinase inhibitors US Patent  US9783556 Publication Date 10/10/2017 
Target
Name:
Tyrosine-protein kinase SYK
Synonyms:
KSYK_HUMAN Spleen Tyrosine Kinase Tyrosine-protein kinase SYK (Syk)
Type:
Enzyme
Mol. Mass.:
72079.99
Organism:
Homo sapiens (Human)
Description:
P43405
Residue:
635
  
Inhibitor
Name:
BDBM345141
Synonyms:
1-(4-((2-((3-Methoxy-5-(2-morpholinoethoxy)phenyl)amino)pyrimidin-4-yl)oxy)naphthalen-1-yl)-3-(1-(p-tolyl)-3-(trimethylsilyl)-1H-pyrazol-5-yl)urea | US9783556, Example 13
Type:
Small organic molecule
Emp. Form.:
C41H46N8O5Si
Mol. Mass.:
758.94
SMILES:
COc1cc(Nc2nccc(Oc3ccc(NC(=O)Nc4cc(nn4-c4ccc(C)cc4)[Si](C)(C)C)c4ccccc34)n2)cc(OCCN2CCOCC2)c1
: