Target
Proto-oncogene tyrosine-protein kinase Src
Ligand
BDBM345143
Substrate
Meas. Tech.
Enzyme Inhibition
IC50
15.0±n/a nM
Citation
 Fyfe, MCMeghani, PThom, SM Kinase inhibitors US Patent  US9783556 Publication Date 10/10/2017 
Target
Name:
Proto-oncogene tyrosine-protein kinase Src
Synonyms:
Calmodulin/Proto-oncogene tyrosine-protein kinase Src Proto-oncogene c-Src SRC SRC_HUMAN V-src sarcoma (Schmidt-Ruppin A-2) viral oncogene homolog (avian) p60-Src | pp60c-src
Type:
Protein
Mol. Mass.:
59838.60
Organism:
Homo sapiens (Human)
Description:
P12931
Residue:
536
  
Inhibitor
Name:
BDBM345143
Synonyms:
1-(4-((2-((7-Methyl-1H-indazol-5-yl)amino)pyrimidin-4-yl)oxy)naphthalen-1-yl)-3-(1-(4-(2-morpholinoethoxy)phenyl)-3-(trimethylsilyl)-1H-pyrazol-5-yl)urea | US9783556, Example 15
Type:
Small organic molecule
Emp. Form.:
C41H44N10O4Si
Mol. Mass.:
768.9382
SMILES:
Cc1cc(Nc2nccc(Oc3ccc(NC(=O)Nc4cc(nn4-c4ccc(OCCN5CCOCC5)cc4)[Si](C)(C)C)c4ccccc34)n2)cc2cn[nH]c12
: