Target
Proto-oncogene tyrosine-protein kinase Src
Ligand
BDBM345146
Substrate
Meas. Tech.
Enzyme Inhibition
IC50
41.0±n/a nM
Citation
 Fyfe, MCMeghani, PThom, SM Kinase inhibitors US Patent  US9783556 Publication Date 10/10/2017 
Target
Name:
Proto-oncogene tyrosine-protein kinase Src
Synonyms:
Calmodulin/Proto-oncogene tyrosine-protein kinase Src Proto-oncogene c-Src SRC SRC_HUMAN V-src sarcoma (Schmidt-Ruppin A-2) viral oncogene homolog (avian) p60-Src | pp60c-src
Type:
Protein
Mol. Mass.:
59838.60
Organism:
Homo sapiens (Human)
Description:
P12931
Residue:
536
  
Inhibitor
Name:
BDBM345146
Synonyms:
1-(2,3-Dichloro-4-((2-((3-methoxy-5-(2-morpholinoethoxy)phenyl)amino)pyrimidin-4-yl)oxy)phenyl)-3-(1-(p-tolyl)-3-(trimethylsilyl)-1H-pyrazol-5-yl)urea | US9783556, Example 18
Type:
Small organic molecule
Emp. Form.:
C37H42Cl2N8O5Si
Mol. Mass.:
777.771
SMILES:
COc1cc(Nc2nccc(Oc3ccc(NC(=O)Nc4cc(nn4-c4ccc(C)cc4)[Si](C)(C)C)c(Cl)c3Cl)n2)cc(OCCN2CCOCC2)c1
: