Target
Glycogen synthase kinase-3 alpha
Ligand
BDBM345147
Substrate
Meas. Tech.
Enzyme Inhibition
IC50
370±n/a nM
Citation
 Fyfe, MCMeghani, PThom, SM Kinase inhibitors US Patent  US9783556 Publication Date 10/10/2017 
Target
Name:
Glycogen synthase kinase-3 alpha
Synonyms:
GSK-3 alpha GSK3A_HUMAN Glycogen synthase kinase-3 Glycogen synthase kinase-3 alpha (GSK3 Alpha) Glycogen synthase kinase-3 alpha (GSK3alpha)
Type:
Enzyme
Mol. Mass.:
50991.79
Organism:
Homo sapiens (Human)
Description:
P49840
Residue:
483
  
Inhibitor
Name:
BDBM345147
Synonyms:
3-Methoxy-N-((2S,3R,4R,5R)-2,3,4,5,6-pentahydroxyhexyl)-5-((4-((4-(3-(1-(p-tolyl)-3-(trimethylsilyl)-1H-pyrazol-5-yl)ureido)naphthalen-1-yl)oxy)pyrimidin-2-yl)amino)-benzamide | US9783556, Example 19
Type:
Small organic molecule
Emp. Form.:
C42H48N8O9Si
Mol. Mass.:
836.9642
SMILES:
COc1cc(Nc2nccc(Oc3ccc(NC(=O)Nc4cc(nn4-c4ccc(C)cc4)[Si](C)(C)C)c4ccccc34)n2)cc(c1)C(=O)NC[C@H](O)[C@@H](O)[C@H](O)[C@H](O)CO
: