Target
Glycogen synthase kinase-3 alpha
Ligand
BDBM345149
Substrate
Meas. Tech.
Enzyme Inhibition
IC50
320±n/a nM
Citation
 Fyfe, MCMeghani, PThom, SM Kinase inhibitors US Patent  US9783556 Publication Date 10/10/2017 
Target
Name:
Glycogen synthase kinase-3 alpha
Synonyms:
GSK-3 alpha GSK3A_HUMAN Glycogen synthase kinase-3 Glycogen synthase kinase-3 alpha (GSK3 Alpha) Glycogen synthase kinase-3 alpha (GSK3alpha)
Type:
Enzyme
Mol. Mass.:
50991.79
Organism:
Homo sapiens (Human)
Description:
P49840
Residue:
483
  
Inhibitor
Name:
BDBM345149
Synonyms:
1-(4-((2-((3-Methoxy-5-(2-(2-(2-methoxyethoxyl)ethoxy)ethoxy)phenyl)amino)pyrimidin-4-yl)oxy)naphthalen-1-yl)-3-(1-(p-tolyl)-3-(trimethylsilyl)-1H-pyrazol-5-yl)urea | US9783556, Example 21
Type:
Small organic molecule
Emp. Form.:
C42H49N7O7Si
Mol. Mass.:
791.9667
SMILES:
COCCOCCOCCOc1cc(Nc2nccc(Oc3ccc(NC(=O)Nc4cc(nn4-c4ccc(C)cc4)[Si](C)(C)C)c4ccccc34)n2)cc(OC)c1
: