Target
5-hydroxytryptamine receptor 2A
Ligand
BDBM345150
Substrate
Meas. Tech.
Enzyme Inhibition
IC50
108±n/a nM
Citation
 Fyfe, MCMeghani, PThom, SM Kinase inhibitors US Patent  US9783556 Publication Date 10/10/2017 
Target
Name:
5-hydroxytryptamine receptor 2A
Synonyms:
5-HT-2 5-HT2A 5-hydroxytryptamine receptor 2A (5HT-2A) 5HT2A_HUMAN HTR2A | Serotonin receptor 2A
Type:
undefined
Mol. Mass.:
52607.65
Organism:
Homo sapiens (Human)
Description:
P28223
Residue:
471
  
Inhibitor
Name:
BDBM345150
Synonyms:
3-Ethynyl-N-(2-morpholinoethyl)-5-((4-((4-(3-(1-(p-tolyl)-3-(trimethylsilyl)-1H-pyrazol-5-yl)ureido)naphthalen-1-yl)oxy)pyrimidin-2-yl)amino)benzamide | US9783556, Example 22
Type:
Small organic molecule
Emp. Form.:
C42H44N10O4Si
Mol. Mass.:
780.9489
SMILES:
Cc1ccc(cc1)-n1nc(cc1NC(=O)Nc1ccc(Oc2ncnc(Nc3cc(cc(c3)C(=O)NCCN3CCOCC3)C#C)n2)c2ccccc12)[Si](C)(C)C
: