Target
Proto-oncogene tyrosine-protein kinase Src
Ligand
BDBM345150
Substrate
Meas. Tech.
Enzyme Inhibition
IC50
25.0±n/a nM
Citation
 Fyfe, MCMeghani, PThom, SM Kinase inhibitors US Patent  US9783556 Publication Date 10/10/2017 
Target
Name:
Proto-oncogene tyrosine-protein kinase Src
Synonyms:
Calmodulin/Proto-oncogene tyrosine-protein kinase Src Proto-oncogene c-Src SRC SRC_HUMAN V-src sarcoma (Schmidt-Ruppin A-2) viral oncogene homolog (avian) p60-Src | pp60c-src
Type:
Protein
Mol. Mass.:
59838.60
Organism:
Homo sapiens (Human)
Description:
P12931
Residue:
536
  
Inhibitor
Name:
BDBM345150
Synonyms:
3-Ethynyl-N-(2-morpholinoethyl)-5-((4-((4-(3-(1-(p-tolyl)-3-(trimethylsilyl)-1H-pyrazol-5-yl)ureido)naphthalen-1-yl)oxy)pyrimidin-2-yl)amino)benzamide | US9783556, Example 22
Type:
Small organic molecule
Emp. Form.:
C42H44N10O4Si
Mol. Mass.:
780.9489
SMILES:
Cc1ccc(cc1)-n1nc(cc1NC(=O)Nc1ccc(Oc2ncnc(Nc3cc(cc(c3)C(=O)NCCN3CCOCC3)C#C)n2)c2ccccc12)[Si](C)(C)C
: