Target
Monocarboxylate transporter 4
Ligand
BDBM345304
Substrate
Meas. Tech.
Assay 3: MCT4-Mediated Lactate Transport in MDA-MB-231 Breast Cancer Cells
IC50
70.0±n/a nM
Citation
 Parnell, KMMcCall, J MCT4 inhibitors for treating disease US Patent  US10202350 Publication Date 2/12/2019 
Target
Name:
Monocarboxylate transporter 4
Synonyms:
MCT 4 MCT4 SLC16A3 | Solute carrier family 16 member 3
Type:
PROTEIN
Mol. Mass.:
49474.36
Organism:
Homo sapiens (Human)
Description:
ChEMBL_104604
Residue:
465
  
Inhibitor
Name:
BDBM345304
Synonyms:
2-([1-[(o-Chlorophenyl)methyl]-5-[m- (dimethylamino)phenyl]-1H-pyrazol-3- yl]methoxy)-2-methylpropionic acid MS: Calculated: 427.92; Found: 428.9 [M + H]. US10214492, Example 50 US11724989, Example 50
Type:
Small organic molecule
Emp. Form.:
C23H26ClN3O3
Mol. Mass.:
427.924
SMILES:
CN(C)c1cccc(c1)-c1cc(COC(C)(C)C(O)=O)nn1Cc1ccccc1Cl
: