Target
Malignant T-cell-amplified sequence 1
Ligand
BDBM345304
Substrate
Meas. Tech.
Assay 4: MCT1-Mediated Lactate Transport in BT20 Breast Cancer Cells
IC50
34000±n/a nM
Citation
 Parnell, KMMcCall, J MCT4 inhibitors for treating disease US Patent  US10202350 Publication Date 2/12/2019 
Target
Name:
Malignant T-cell-amplified sequence 1
Synonyms:
MCT-1 MCTS1 Multiple copies T-cell malignancies
Type:
Enzyme Catalytic Domain
Mol. Mass.:
20563.62
Organism:
Homo sapiens (human)
Description:
Residue:
181
  
Inhibitor
Name:
BDBM345304
Synonyms:
2-([1-[(o-Chlorophenyl)methyl]-5-[m- (dimethylamino)phenyl]-1H-pyrazol-3- yl]methoxy)-2-methylpropionic acid MS: Calculated: 427.92; Found: 428.9 [M + H]. US10214492, Example 50 US11724989, Example 50
Type:
Small organic molecule
Emp. Form.:
C23H26ClN3O3
Mol. Mass.:
427.924
SMILES:
CN(C)c1cccc(c1)-c1cc(COC(C)(C)C(O)=O)nn1Cc1ccccc1Cl
: