Target
Proto-oncogene tyrosine-protein kinase receptor Ret [V804L]
Ligand
BDBM50363397
Substrate
Meas. Tech.
RET V804L Gatekeeper Mutant Assay at KM
IC50
29.8±n/a nM
Citation
 Brooijmans, NDiPietro, LVFleming, PEKim, JLWenglowsky, SMZhang, Y 2-(pyridin-3-yl)-pyrimidine derivatives as RET inhibitors US Patent  US10202365 Publication Date 2/12/2019 
Target
Name:
Proto-oncogene tyrosine-protein kinase receptor Ret [V804L]
Synonyms:
CDHF12 PTC RET kinase (V804L) RET51 | RET_HUMAN
Type:
Enzyme Catalytic Domain
Mol. Mass.:
124332.32
Organism:
Homo sapiens (Human)
Description:
P07949[V804L]
Residue:
1114
  
Inhibitor
Name:
BDBM50363397
Synonyms:
CHEMBL1946170 US10183928, Regorafenib US10227329, Compound Regorafenib US10584114, Compound Regorafenib US11279688, Compound Regorafenib
Type:
Small organic molecule
Emp. Form.:
C21H15ClF4N4O3
Mol. Mass.:
482.815
SMILES:
CNC(=O)c1cc(Oc2ccc(NC(=O)Nc3ccc(Cl)c(c3)C(F)(F)F)c(F)c2)ccn1
: