Target
Intermediate conductance calcium-activated potassium channel protein 4
Ligand
BDBM205051
Substrate
Meas. Tech.
Inhibition Assay
pH
7.3±n/a
IC50
460±0 nM
Comments
extracted
Citation
 Demnitz, JJorgensen, S Tetrazole derivatives and their use as potassium channel modulators US Patent  US9556132 Publication Date 1/31/2017 
Target
Name:
Intermediate conductance calcium-activated potassium channel protein 4
Synonyms:
IK1 KCA4 KCNN4_HUMAN SK4
Type:
PROTEIN
Mol. Mass.:
47723.22
Organism:
Homo sapiens (Human)
Description:
ChEMBL_1361891
Residue:
427
  
Inhibitor
Name:
BDBM205051
Synonyms:
US9556132, 14 | process for preparing 1-(2-fluorophenyl)-5-{2-[2-(methylthio)phenyl]phenyl}-1h-1,2,3,4-tetrazole
Type:
Small organic molecule
Emp. Form.:
C20H15FN4S
Mol. Mass.:
362.423
SMILES:
CSc1ccccc1-c1ccccc1-c1nnnn1-c1ccccc1F
: