Target
cGMP-specific 3',5'-cyclic phosphodiesterase [531-875]
Ligand
BDBM14771
Substrate
BDBM14391
Meas. Tech.
Phosphodiesterase (PDE) Inhibition Assay
IC50
53000±n/a nM
Citation
 Card, GLEngland, BPSuzuki, YFong, DPowell, BLee, BLuu, CTabrizizad, MGillette, SIbrahim, PNArtis, DRBollag, GMilburn, MVKim, SHSchlessinger, JZhang, KY Structural basis for the activity of drugs that inhibit phosphodiesterases. Structure 12:2233-47 (2004)  
Target
Name:
cGMP-specific 3',5'-cyclic phosphodiesterase [531-875]
Synonyms:
CGB-PDE PDE5A Phosphodiesterase Type 5 (PDE5A) cGMP-specific 3,5-cyclic phosphodiesterase
Type:
Enzyme Catalytic Domain
Mol. Mass.:
39756.36
Organism:
Homo sapiens (Human)
Description:
Recombinant catalytic domain (S531-N875) of human PDE5A.
Residue:
345
  
Inhibitor
Name:
BDBM14771
Synonyms:
(E)-{1-[3-(cyclopentyloxy)-4-methoxyphenyl]ethylidene}amino carbamate [1-(3-cyclopentyloxy-4-methoxy-phenyl)ethylideneamino] carbamate
Type:
Small organic molecule
Emp. Form.:
C15H20N2O4
Mol. Mass.:
292.3303
SMILES:
COc1ccc(cc1OC1CCCC1)C(C)=NOC(N)=O
:
Substrate
Name:
BDBM14391
Synonyms:
2-amino-9-[(4aR,6R,7R,7aS)-2,7-dihydroxy-2-oxidotetrahydro-4H-furo[3,2-d][1,3,2]dioxaphosphinin-6-yl]-1,9-dihydro-6H-purin-6-one GUANOSINE-3 ,5 -MONOPHOSPHATE cGMP
Type:
Nucleoside or nucleotide
Emp. Form.:
C10H12N5O7P
Mol. Mass.:
345.2053
SMILES:
Nc1nc2n(cnc2c(=O)[nH]1)[C@@H]1O[C@@H]2COP(O)(=O)O[C@H]2[C@H]1O
: