Target
cAMP-specific 3',5'-cyclic phosphodiesterase 7B [91-450]
Ligand
BDBM14771
Substrate
BDBM10851
Meas. Tech.
Phosphodiesterase (PDE) Inhibition Assay
IC50
990±n/a nM
Citation
 Card, GLEngland, BPSuzuki, YFong, DPowell, BLee, BLuu, CTabrizizad, MGillette, SIbrahim, PNArtis, DRBollag, GMilburn, MVKim, SHSchlessinger, JZhang, KY Structural basis for the activity of drugs that inhibit phosphodiesterases. Structure 12:2233-47 (2004)  
Target
Name:
cAMP-specific 3',5'-cyclic phosphodiesterase 7B [91-450]
Synonyms:
PDE7B Phosphodiesterase Type 7 (PDE7B) | cAMP-specific 3,5-cyclic phosphodiesterase 7B
Type:
Enzyme Catalytic Domain
Mol. Mass.:
41494.16
Organism:
Homo sapiens (Human)
Description:
Recombinant catalytic domain (Q91-P450) of human PDE7B.
Residue:
360
  
Inhibitor
Name:
BDBM14771
Synonyms:
(E)-{1-[3-(cyclopentyloxy)-4-methoxyphenyl]ethylidene}amino carbamate [1-(3-cyclopentyloxy-4-methoxy-phenyl)ethylideneamino] carbamate
Type:
Small organic molecule
Emp. Form.:
C15H20N2O4
Mol. Mass.:
292.3303
SMILES:
COc1ccc(cc1OC1CCCC1)C(C)=NOC(N)=O
:
Substrate
Name:
BDBM10851
Synonyms:
(4aR,6R,7R,7aS)-6-(6-amino-9H-purin-9-yl)-2,7-dihydroxy-hexahydro-1,3,5,2-furo[3,2-d][1,3,2]dioxaphosphinin-2-one ADENOSINE-3 ,5 -CYCLIC-MONOPHOSPHATE cAMP | cid_23902375
Type:
Small organic molecule
Emp. Form.:
C10H12N5O6P
Mol. Mass.:
329.2059
SMILES:
Nc1ncnc2n(cnc12)[C@@H]1O[C@@H]2COP(O)(=O)O[C@H]2[C@H]1O
: