Target
P2X purinoceptor 2/3
Ligand
BDBM319962
Substrate
Meas. Tech.
Intracellular Calcium Measurement to Assess Antagonist Activity
IC50
33.0±n/a nM
Citation
 Davenport, AJBräuer, NFischer, OMRotgeri, ARottmann, ANeagoe, INagel, JGodinho-Coelho, AKlar, J 1,3-thiazol-2-yl substituted benzamides US Patent  US10202369 Publication Date 2/12/2019 
Target
Name:
P2X purinoceptor 2/3
Synonyms:
P2X2/3 | P2X2/P2X3 heterotrimeric receptor
Type:
Protein
Mol. Mass.:
Description:
Components:
This complex has 2 components.
Component 1
Name:
P2X purinoceptor 2
Synonyms:
ATP receptor P2RX2_HUMAN Purinergic receptor | PurinergicP2X2/3
Type:
Enzyme Catalytic Domain
Mol. Mass.:
51765.18
Organism:
Homo sapiens (Human)
Description:
PurinergicP2X2/3 0 HUMAN::Q9UBL9
Residue:
471
  
Component 2
Name:
P2X purinoceptor 3
Synonyms:
ATP receptor P2RX3 P2X purinoceptor 3 P2X purinoceptor 3 (P2X3) P2X3 purinoceptor p2x3 + hsa
Type:
Protein
Mol. Mass.:
44292.02
Organism:
Homo sapiens (Human)
Description:
P56373
Residue:
397
  
Inhibitor
Name:
BDBM319962
Synonyms:
3-(5-Ethyl-1,3-thiazol-2-yl)-5-(tetrahydro-2H-pyran-4-yloxy)-N-{(1R)-1-[2-(trifluoromethyl)pyrimidin-5-yl]ethyl}benzamide US10202369, Example 129 | US10472354, Example 129
Type:
Small organic molecule
Emp. Form.:
C24H25F3N4O3S
Mol. Mass.:
506.541
SMILES:
CCc1cnc(s1)-c1cc(OC2CCOCC2)cc(c1)C(=O)N[C@H](C)c1cnc(nc1)C(F)(F)F
: