Target
Phosphatidylinositol 4,5-bisphosphate 3-kinase catalytic subunit beta isoform
Ligand
BDBM346171
Substrate
Meas. Tech.
Cellular Assays for PI3Kalpha, Beta and Delta
IC50
20.0±n/a nM
Citation
 Fairhurst, RAFuret, PKalthoff, FSLerchner, ARueeger, H Oxazolidin-2-one-pyrimidine derivatives and the use thereof as phosphatidylinositol-3-kinase inhibitors US Patent  US10202371 Publication Date 2/12/2019 
Target
Name:
Phosphatidylinositol 4,5-bisphosphate 3-kinase catalytic subunit beta isoform
Synonyms:
PI3-kinase subunit beta PI3Kbeta Phosphatidylinositol 4,5-bisphosphate 3-kinase 110 kDa catalytic subunit beta PtdIns-3-kinase subunit beta p110beta
Type:
Enzyme Catalytic Domain
Mol. Mass.:
122616.58
Organism:
Rattus norvegicus (Rat)
Description:
Q9Z1L0
Residue:
1070
  
Inhibitor
Name:
BDBM346171
Synonyms:
(4S,5R)-3-(2′-Amino-2-morpholin-4-yl-4′-trifluoromethyl-[4,5′]bipyrimidinyl-6-yl)-4-methyl-5-thiazol-2-yl-oxazolidin-2-one | US10202371, Example 1
Type:
Small organic molecule
Emp. Form.:
C20H19F3N8O3S
Mol. Mass.:
508.477
SMILES:
C[C@H]1[C@@H](OC(=O)N1c1cc(nc(n1)N1CCOCC1)-c1cnc(N)nc1C(F)(F)F)c1nccs1
: