Target
Phosphatidylinositol 4,5-bisphosphate 3-kinase catalytic subunit beta isoform
Ligand
BDBM346183
Substrate
Meas. Tech.
Cellular Assays for PI3Kalpha, Beta and Delta
IC50
<3.00±n/a nM
Citation
 Fairhurst, RAFuret, PKalthoff, FSLerchner, ARueeger, H Oxazolidin-2-one-pyrimidine derivatives and the use thereof as phosphatidylinositol-3-kinase inhibitors US Patent  US10202371 Publication Date 2/12/2019 
Target
Name:
Phosphatidylinositol 4,5-bisphosphate 3-kinase catalytic subunit beta isoform
Synonyms:
PI3-kinase subunit beta PI3Kbeta Phosphatidylinositol 4,5-bisphosphate 3-kinase 110 kDa catalytic subunit beta PtdIns-3-kinase subunit beta p110beta
Type:
Enzyme Catalytic Domain
Mol. Mass.:
122616.58
Organism:
Rattus norvegicus (Rat)
Description:
Q9Z1L0
Residue:
1070
  
Inhibitor
Name:
BDBM346183
Synonyms:
US10202371, Example 13
Type:
Small organic molecule
Emp. Form.:
C25H26F3N7O6
Mol. Mass.:
577.5124
SMILES:
Nc1ncc(-c2cc(nc(n2)N2CCOCC2)N2[C@@H](CO)[C@@H](OC2=O)c2ccc(OCCO)cc2)c(n1)C(F)(F)F
: