Target
Proto-oncogene Wnt-1
Ligand
BDBM346356
Substrate
Meas. Tech.
The screening assay for Wnt activity
IC50
40.1±n/a nM
Citation
 KC, SKWallace, DMCao, JChiruta, CHood, J 3-(1H-benzo[D]imidazol-2-yl)-1H-pyrazolo[3,4-C]pyridine and therapeutic uses thereof US Patent  US10202377 Publication Date 2/12/2019 
Target
Name:
Proto-oncogene Wnt-1
Synonyms:
INT1 WNT1 | WNT1_HUMAN
Type:
Enzyme Catalytic Domain
Mol. Mass.:
41006.01
Organism:
Homo sapiens (human)
Description:
P04628
Residue:
370
  
Inhibitor
Name:
BDBM346356
Synonyms:
US10202377, Compound 439
Type:
Small organic molecule
Emp. Form.:
C34H29FN8O2S
Mol. Mass.:
632.71
SMILES:
CS(=O)(=O)NCc1cc(F)cc(c1)-c1cccc2[nH]c(nc12)-c1n[nH]c2cnc(cc12)-c1cncc(CNCc2ccccc2)c1
: