Target
Proto-oncogene Wnt-1
Ligand
BDBM346360
Substrate
Meas. Tech.
The screening assay for Wnt activity
IC50
51.6±n/a nM
Citation
 KC, SKWallace, DMCao, JChiruta, CHood, J 3-(1H-benzo[D]imidazol-2-yl)-1H-pyrazolo[3,4-C]pyridine and therapeutic uses thereof US Patent  US10202377 Publication Date 2/12/2019 
Target
Name:
Proto-oncogene Wnt-1
Synonyms:
INT1 WNT1 | WNT1_HUMAN
Type:
Enzyme Catalytic Domain
Mol. Mass.:
41006.01
Organism:
Homo sapiens (human)
Description:
P04628
Residue:
370
  
Inhibitor
Name:
BDBM346360
Synonyms:
US10202377, Compound 454
Type:
Small organic molecule
Emp. Form.:
C31H32FN9
Mol. Mass.:
549.6445
SMILES:
CC(C)Nc1cncc(c1)-c1cc2c(n[nH]c2cn1)-c1nc2c(cccc2[nH]1)-c1cc(F)cc(NCCN(C)C)c1
: