Target
Ubiquitin carboxyl-terminal hydrolase 2
Ligand
BDBM205457
Substrate
Meas. Tech.
Fluorometric Ub-AMC Hydrolysis Assay
pH
7.5±n/a
Temperature
298.15±n/a K
IC50
28700±n/a nM
Comments
extracted
Citation
 Ott, CABaljinnyam, BZakharov, AVJadhav, ASimeonov, AZhuang, Z Cell Lysate-Based AlphaLISA Deubiquitinase Assay Platform for Identification of Small Molecule Inhibitors. ACS Chem Biol 12:2399-2407 (2017)  
Target
Name:
Ubiquitin carboxyl-terminal hydrolase 2
Synonyms:
41 kDa ubiquitin-specific protease UBP2_HUMAN USP2 Ubiquitin-specific-processing protease 2
Type:
PROTEIN
Mol. Mass.:
68093.61
Organism:
Homo sapiens (Human)
Description:
ChEMBL_103660
Residue:
605
  
Inhibitor
Name:
BDBM205457
Synonyms:
(2R,4aS,6aR,6aS,14aS,14bR)-10-hydroxy-2,4a,6a,6a,9,14a-hexamethyl-11-oxo-1,3,4,5,6,13,14,14b-octahydropicene-2-carboxylic acid US11660306, Example Celastrol | acs.jmedchem.1c00409_ST.357
Type:
Small organic molecule
Emp. Form.:
C29H38O4
Mol. Mass.:
450.6096
SMILES:
CC1=C(O)C(=O)C=C2C1=CC=C1[C@@]2(C)CC[C@@]2(C)[C@@H]3C[C@@](C)(CC[C@]3(C)CC[C@]12C)C(O)=O
: