Target
Ubiquitin carboxyl-terminal hydrolase 15
Ligand
BDBM50442907
Substrate
Meas. Tech.
Fluorometric Ub-AMC Hydrolysis Assay
pH
7.5±n/a
Temperature
298.15±n/a K
IC50
11100±n/a nM
Comments
extracted
Citation
 Ott, CABaljinnyam, BZakharov, AVJadhav, ASimeonov, AZhuang, Z Cell Lysate-Based AlphaLISA Deubiquitinase Assay Platform for Identification of Small Molecule Inhibitors. ACS Chem Biol 12:2399-2407 (2017)  
Target
Name:
Ubiquitin carboxyl-terminal hydrolase 15
Synonyms:
Deubiquitinating enzyme 15 UBP15_HUMAN Ubiquitin thioesterase 15 Unph-2 | Unph4
Type:
Protein
Mol. Mass.:
112388.07
Organism:
Homo sapiens (Human)
Description:
Q9Y4E8
Residue:
981
  
Inhibitor
Name:
BDBM50442907
Synonyms:
Acetyl Isogambogic Acid | CHEMBL3039433
Type:
Small organic molecule
Emp. Form.:
C40H46O9
Mol. Mass.:
670.7878
SMILES:
[H]C12[#6]-[#6@H]-3-[#6]=[#6]4-[#6](=O)-c5c(-[#8]-[#6](-[#6])=O)c6-[#6]=[#6]C([#6])([#6]-[#6]\[#6]=[#6](\[#6])-[#6])[#8]-c6c(-[#6]\[#6]=[#6](\[#6])-[#6])c5-[#8][C@@]14C([#6]\[#6]=[#6](/[#6])-[#6](-[#8])=O)([#8]C2([#6])[#6])[#6]-3=O
: