Target
Ubiquitin carboxyl-terminal hydrolase 15
Ligand
BDBM200235
Substrate
Meas. Tech.
Fluorometric Ub-AMC Hydrolysis Assay
pH
7.5±n/a
Temperature
298.15±n/a K
IC50
46100±n/a nM
Comments
extracted
Citation
 Ott, CABaljinnyam, BZakharov, AVJadhav, ASimeonov, AZhuang, Z Cell Lysate-Based AlphaLISA Deubiquitinase Assay Platform for Identification of Small Molecule Inhibitors. ACS Chem Biol 12:2399-2407 (2017)  
Target
Name:
Ubiquitin carboxyl-terminal hydrolase 15
Synonyms:
Deubiquitinating enzyme 15 UBP15_HUMAN Ubiquitin thioesterase 15 Unph-2 | Unph4
Type:
Protein
Mol. Mass.:
112388.07
Organism:
Homo sapiens (Human)
Description:
Q9Y4E8
Residue:
981
  
Inhibitor
Name:
BDBM200235
Synonyms:
Rifampicin | cid_5381226
Type:
Small organic molecule
Emp. Form.:
C43H58N4O12
Mol. Mass.:
822.9402
SMILES:
CO[C@H]1\C=C\O[C@@]2(C)Oc3c(C2=O)c2C(=O)\C(=C\NN4CCN(C)CC4)C(NC(=O)\C(C)=C/C=C/[C@H](C)[C@H](O)[C@@H](C)[C@@H](O)[C@@H](C)[C@H](OC(C)=O)[C@@H]1C)=C(O)c2c(O)c3C
: