Target
G protein-activated inward rectifier potassium channel 4
Ligand
BDBM347046
Substrate
Meas. Tech.
TBD
IC50
578±n/a nM
Citation
 Duncia, JVGardner, DSHynes, JMacor, JENair, SKPaidi, VRSantella, JBSarkunam, KSistla, RKPolimera, SRWu, H Heteroaryl substituted aminopyridine compounds US Patent  US10202390 Publication Date 2/12/2019 
Target
Name:
G protein-activated inward rectifier potassium channel 4
Synonyms:
CIR GIRK-4 Heart KATP channel Inward rectifier K(+) channel Kir3.4 KCNJ5 Potassium channel, inwardly rectifying subfamily J member 5
Type:
PROTEIN
Mol. Mass.:
47658.06
Organism:
Homo sapiens (Human)
Description:
ChEMBL_107914
Residue:
419
  
Inhibitor
Name:
BDBM347046
Synonyms:
3-(5-(4-(2-hydroxypropan-2-yl)-1H-pyrazol-1-yl)-4-(isopropylamino)pyridin-2-yl) pyrazolo[1,5-a]pyrimidine-6-carbonitrile | US10202390, Example 1
Type:
Small organic molecule
Emp. Form.:
C21H22N8O
Mol. Mass.:
402.4524
SMILES:
CC(C)Nc1cc(ncc1-n1cc(cn1)C(C)(C)O)-c1cnn2cc(cnc12)C#N
: