Target
G protein-activated inward rectifier potassium channel 4
Ligand
BDBM347057
Substrate
Meas. Tech.
TBD
IC50
9.00±n/a nM
Citation
 Duncia, JVGardner, DSHynes, JMacor, JENair, SKPaidi, VRSantella, JBSarkunam, KSistla, RKPolimera, SRWu, H Heteroaryl substituted aminopyridine compounds US Patent  US10202390 Publication Date 2/12/2019 
Target
Name:
G protein-activated inward rectifier potassium channel 4
Synonyms:
CIR GIRK-4 Heart KATP channel Inward rectifier K(+) channel Kir3.4 KCNJ5 Potassium channel, inwardly rectifying subfamily J member 5
Type:
PROTEIN
Mol. Mass.:
47658.06
Organism:
Homo sapiens (Human)
Description:
ChEMBL_107914
Residue:
419
  
Inhibitor
Name:
BDBM347057
Synonyms:
US10202390, Example 12
Type:
Small organic molecule
Emp. Form.:
C20H21N9
Mol. Mass.:
387.441
SMILES:
CCCc1cn(nn1)-c1cnc(cc1NC(C)C)-c1cnn2cc(cnc12)C#N
: