Target
Orexin receptor type 2
Ligand
BDBM205898
Substrate
Orexin receptor 1
Meas. Tech.
Radioligand binding assay
Ki
0.3±n/a nM
Citation
 Kuduk, SDSkudlarek, JW 2-pyridyloxy-3-substituted-4-nitrile orexin receptor antagonists US Patent  US9546152 Publication Date 1/17/2017 
Target
Name:
Orexin receptor type 2
Synonyms:
HCRTR2 OX2R_HUMAN Orexin receptor type 2 (OR-2) Orexin receptor type 2 (OX2R) Ox-2-R | Ox2-R
Type:
Protein
Mol. Mass.:
50710.53
Organism:
Homo sapiens (Human)
Description:
O43614
Residue:
444
  
Inhibitor
Name:
BDBM205898
Synonyms:
2-{[(3r,6r)-1-{[2-fluoro-6- (2h-1,2,3-triazol-2- yl)phenyl]carbonyl}-6- methylpiperidin-3-yl]oxy}-3- methoxypyridine-4- carbonitrile | US9546152, example 100
Type:
Small organic molecule
Emp. Form.:
C22H21FN6O3
Mol. Mass.:
436.4389
SMILES:
COc1c(O[C@@H]2CC[C@@H](C)N(C2)C(=O)c2c(F)cccc2-n2nccn2)nccc1C#N
:
Substrate
Name:
Orexin/Hypocretin receptor type 1
Synonyms:
HCRTR1 OX1R_HUMAN Orexin receptor type 1 (OR 1) Orexin receptor type 1 (OX1) Orexin receptor type 1 (OxR1) | Ox1r
Type:
Protein
Mol. Mass.:
47554.50
Organism:
Homo sapiens (Human)
Description:
O43613
Residue:
425