Target
Interleukin-1 receptor-associated kinase 4
Ligand
BDBM209379
Substrate
Meas. Tech.
Inhibition Assay
pH
7.2±n/a
Temperature
298.15±n/a K
IC50
1.90±n/a nM
Comments
extracted
Citation
 Bhide, RSDuncia, JVHynes, JNair, SKPitts, WJKumar, SRGardner, DSMurugesan, NPaidi, VRSantella, JBSistla, RWu, H Bicyclic heterocycle substituted pyridyl compounds useful as kinase modulators US Patent  US9546153 Publication Date 1/17/2017 
Target
Name:
Interleukin-1 receptor-associated kinase 4
Synonyms:
IRAK-4 IRAK4_HUMAN Interleukin-1 receptor-associated kinase 4 (IRAK4) | Renal carcinoma antigen NY-REN-64
Type:
Protein
Mol. Mass.:
51519.08
Organism:
Homo sapiens (Human)
Description:
Q9NWZ3
Residue:
460
  
Inhibitor
Name:
BDBM209379
Synonyms:
US9546153, ex. 95
Type:
Small organic molecule
Emp. Form.:
C26H31FN6O2
Mol. Mass.:
478.5617
SMILES:
CC(C)(O)[C@H](F)CNC(=O)c1cnc(Nc2ccc3nccnc3c2)cc1NC1CC2CCC1C2
: