Target
Interleukin-1 receptor-associated kinase 4
Ligand
BDBM209848
Substrate
Meas. Tech.
Inhibition Assay
pH
7.2±n/a
Temperature
298.15±n/a K
IC50
2.00±n/a nM
Comments
extracted
Citation
 Bhide, RSDuncia, JVHynes, JNair, SKPitts, WJKumar, SRGardner, DSMurugesan, NPaidi, VRSantella, JBSistla, RWu, H Bicyclic heterocycle substituted pyridyl compounds useful as kinase modulators US Patent  US9546153 Publication Date 1/17/2017 
Target
Name:
Interleukin-1 receptor-associated kinase 4
Synonyms:
IRAK-4 IRAK4_HUMAN Interleukin-1 receptor-associated kinase 4 (IRAK4) | Renal carcinoma antigen NY-REN-64
Type:
Protein
Mol. Mass.:
51519.08
Organism:
Homo sapiens (Human)
Description:
Q9NWZ3
Residue:
460
  
Inhibitor
Name:
BDBM209848
Synonyms:
US9546153, ex. 195
Type:
Small organic molecule
Emp. Form.:
C26H34N6O2S
Mol. Mass.:
494.652
SMILES:
CC(C)NC(=O)[C@H]1CC[C@@H](CC1)NC(=O)c1cnc(Nc2ccc3ncsc3c2)cc1NC(C)C
: