Target
Renin
Ligand
BDBM347289
Substrate
Meas. Tech.
n-Vitro Fluorescence Assay for Identification of Renin-Inhibitory Activity
IC50
320±n/a nM
Citation
 Klein, M Hydroxy-ethylene derivatives for the treatment of arthrosis US Patent  US10202418 Publication Date 2/12/2019 
Target
Name:
Renin
Synonyms:
Angiotensinogenase RENI_HUMAN
Type:
Enzyme
Mol. Mass.:
45058.99
Organism:
Homo sapiens (Human)
Description:
Residue:
406
  
Inhibitor
Name:
BDBM347289
Synonyms:
US10202418, Compound A1
Type:
Small organic molecule
Emp. Form.:
C40H64N8O7
Mol. Mass.:
768.9856
SMILES:
CC[C@H](C)[C@H](NC(=O)CC[C@H](O)[C@H](Cc1ccccc1)NC(=O)[C@@H](NC(=O)[C@H](CC(C)C)NC(=O)OC(C)(C)C)C(C)C)C(=O)NCc1cnc(C)nc1N
: