Target
Cathepsin D
Ligand
BDBM347292
Substrate
Meas. Tech.
n-Vitro Fluorescence Assay for Identification of Cathepsin D Inhibitors
IC50
4000±n/a nM
Citation
 Klein, M Hydroxy-ethylene derivatives for the treatment of arthrosis US Patent  US10202418 Publication Date 2/12/2019 
Target
Name:
Cathepsin D
Synonyms:
CATD_HUMAN CTSD Cathepsin D heavy chain Cathepsin D precursor
Type:
Enzyme
Mol. Mass.:
44551.72
Organism:
Homo sapiens (Human)
Description:
Human proCathepsin D (SwissProt accession number P07339) was expressed in Sf9 cells, purified, and autoactivated.
Residue:
412
  
Inhibitor
Name:
BDBM347292
Synonyms:
US10202418, Compound A4
Type:
Small organic molecule
Emp. Form.:
C35H42F3N3O6
Mol. Mass.:
657.7197
SMILES:
COc1ccc(OC(F)(F)F)cc1CC(=O)N[C@@H](C(C)C)C(=O)N[C@@H](Cc1ccccc1)[C@@H](O)CCC(=O)NCCc1ccccc1
: