Target
Renin
Ligand
BDBM347295
Substrate
Meas. Tech.
n-Vitro Fluorescence Assay for Identification of Renin-Inhibitory Activity
IC50
>30000±n/a nM
Citation
 Klein, M Hydroxy-ethylene derivatives for the treatment of arthrosis US Patent  US10202418 Publication Date 2/12/2019 
Target
Name:
Renin
Synonyms:
Angiotensinogenase RENI_HUMAN
Type:
Enzyme
Mol. Mass.:
45058.99
Organism:
Homo sapiens (Human)
Description:
Residue:
406
  
Inhibitor
Name:
BDBM347295
Synonyms:
US10202418, Compound A7
Type:
Small organic molecule
Emp. Form.:
C34H43N3O5
Mol. Mass.:
573.7223
SMILES:
COc1ccc(CC(=O)N[C@@H](C(C)C)C(=O)N[C@@H](Cc2ccccc2)[C@@H](O)CCC(=O)NCCc2ccccc2)cc1
: