Target
Cathepsin D
Ligand
BDBM347300
Substrate
Meas. Tech.
n-Vitro Fluorescence Assay for Identification of Cathepsin D Inhibitors
IC50
4300±n/a nM
Citation
 Klein, M Hydroxy-ethylene derivatives for the treatment of arthrosis US Patent  US10202418 Publication Date 2/12/2019 
Target
Name:
Cathepsin D
Synonyms:
CATD_HUMAN CTSD Cathepsin D heavy chain Cathepsin D precursor
Type:
Enzyme
Mol. Mass.:
44551.72
Organism:
Homo sapiens (Human)
Description:
Human proCathepsin D (SwissProt accession number P07339) was expressed in Sf9 cells, purified, and autoactivated.
Residue:
412
  
Inhibitor
Name:
BDBM347300
Synonyms:
US10202418, Compound A13
Type:
Small organic molecule
Emp. Form.:
C39H45N3O4
Mol. Mass.:
619.7923
SMILES:
CC(C)[C@H](NC(=O)C(c1ccccc1)c1ccccc1)C(=O)N[C@@H](Cc1ccccc1)[C@@H](O)CCC(=O)NCCc1ccccc1
: