Target
Renin
Ligand
BDBM347301
Substrate
Meas. Tech.
n-Vitro Fluorescence Assay for Identification of Renin-Inhibitory Activity
IC50
>30000±n/a nM
Citation
 Klein, M Hydroxy-ethylene derivatives for the treatment of arthrosis US Patent  US10202418 Publication Date 2/12/2019 
Target
Name:
Renin
Synonyms:
Angiotensinogenase RENI_HUMAN
Type:
Enzyme
Mol. Mass.:
45058.99
Organism:
Homo sapiens (Human)
Description:
Residue:
406
  
Inhibitor
Name:
BDBM347301
Synonyms:
US10202418, Compound A14
Type:
Small organic molecule
Emp. Form.:
C39H45N3O5
Mol. Mass.:
635.7917
SMILES:
CC(C)[C@H](NC(=O)Cc1cccc(Oc2ccccc2)c1)C(=O)N[C@@H](Cc1ccccc1)[C@@H](O)CCC(=O)Nc1c(C)cccc1C
: