Target
Cathepsin D
Ligand
BDBM347304
Substrate
Meas. Tech.
n-Vitro Fluorescence Assay for Identification of Cathepsin D Inhibitors
IC50
255±n/a nM
Citation
 Klein, M Hydroxy-ethylene derivatives for the treatment of arthrosis US Patent  US10202418 Publication Date 2/12/2019 
Target
Name:
Cathepsin D
Synonyms:
CATD_HUMAN CTSD Cathepsin D heavy chain Cathepsin D precursor
Type:
Enzyme
Mol. Mass.:
44551.72
Organism:
Homo sapiens (Human)
Description:
Human proCathepsin D (SwissProt accession number P07339) was expressed in Sf9 cells, purified, and autoactivated.
Residue:
412
  
Inhibitor
Name:
BDBM347304
Synonyms:
US10202418, Compound A17 | US10202418, Compound A18
Type:
Small organic molecule
Emp. Form.:
C43H65N5O8
Mol. Mass.:
780.0049
SMILES:
COC(=O)[C@@H](NC(=O)[C@H](Cc1ccccc1)NC(=O)CC[C@H](O)[C@H](Cc1ccccc1)NC(=O)[C@@H](NC(=O)[C@H](CC(C)C)NC(=O)CC(C)C)C(C)C)C(C)C
: