Target
Renin
Ligand
BDBM347307
Substrate
Meas. Tech.
n-Vitro Fluorescence Assay for Identification of Renin-Inhibitory Activity
IC50
>30000±n/a nM
Citation
 Klein, M Hydroxy-ethylene derivatives for the treatment of arthrosis US Patent  US10202418 Publication Date 2/12/2019 
Target
Name:
Renin
Synonyms:
Angiotensinogenase RENI_HUMAN
Type:
Enzyme
Mol. Mass.:
45058.99
Organism:
Homo sapiens (Human)
Description:
Residue:
406
  
Inhibitor
Name:
BDBM347307
Synonyms:
US10202418, Compound A20
Type:
Small organic molecule
Emp. Form.:
C35H45N3O4
Mol. Mass.:
571.7495
SMILES:
CC(C)[C@H](NC(=O)CCCc1ccccc1)C(=O)N[C@@H](Cc1ccccc1)[C@@H](O)CCC(=O)NCCc1ccccc1
: