Target
Renin
Ligand
BDBM347309
Substrate
Meas. Tech.
n-Vitro Fluorescence Assay for Identification of Renin-Inhibitory Activity
IC50
>30000±n/a nM
Citation
 Klein, M Hydroxy-ethylene derivatives for the treatment of arthrosis US Patent  US10202418 Publication Date 2/12/2019 
Target
Name:
Renin
Synonyms:
Angiotensinogenase RENI_HUMAN
Type:
Enzyme
Mol. Mass.:
45058.99
Organism:
Homo sapiens (Human)
Description:
Residue:
406
  
Inhibitor
Name:
BDBM347309
Synonyms:
US10202418, Compound A22
Type:
Small organic molecule
Emp. Form.:
C37H51F3N4O8
Mol. Mass.:
736.818
SMILES:
CC[C@H](C)[C@H](NC(=O)CC[C@H](O)[C@H](Cc1ccccc1)NC(=O)[C@@H](NC(=O)Cc1cccc(OC(F)(F)F)c1)C(C)C)C(=O)N[C@@H](C(C)C)C(O)=O
: