Target
Somatostatin receptor type 3
Ligand
BDBM50081055
Substrate
Meas. Tech.
Radioligand Binding Assay
Ki
>8615±n/a nM
Citation
 Giovannini, RCui, YDoods, HFerrara, MJust, SKuelzer, RLingard, IMazzaferro, RRudolf, K Somatostatin receptor subtype 4 (SSTR4) agonists US Patent  US9789082 Publication Date 10/17/2017 
Target
Name:
Somatostatin receptor type 3
Synonyms:
SOMATOSTATIN SST3 SS3-R SSR-28 SSTR3 | Somatostatin receptor type 3 (SSTR3)
Type:
Protein
Mol. Mass.:
45855.97
Organism:
Homo sapiens (Human)
Description:
P32745
Residue:
418
  
Inhibitor
Name:
BDBM50081055
Synonyms:
CHEMBL3421843 US10675268, Example 49 | US9789082, Example 49
Type:
Small organic molecule
Emp. Form.:
C17H22N4O
Mol. Mass.:
298.3828
SMILES:
[H][C@@]12CNC[C@]1([H])[C@H]2C(=O)NC(C)(C)c1nn(C)c2ccccc12
: