Target
Somatostatin receptor type 4
Ligand
BDBM311971
Substrate
Meas. Tech.
Radioligand Binding Assay
Ki
3.40±n/a nM
Citation
 Giovannini, RCui, YDoods, HFerrara, MJust, SKuelzer, RLingard, IMazzaferro, RRudolf, K Somatostatin receptor subtype 4 (SSTR4) agonists US Patent  US9789082 Publication Date 10/17/2017 
Target
Name:
Somatostatin receptor type 4
Synonyms:
SOMATOSTATIN SST4 SS4-R SSR4_HUMAN SSTR4 | Somatostatin receptor type 4 (SSTR4)
Type:
Enzyme
Mol. Mass.:
42015.38
Organism:
Homo sapiens (Human)
Description:
P31391
Residue:
388
  
Inhibitor
Name:
BDBM311971
Synonyms:
US10166214, Example 107 US9789082, Example 107
Type:
Small organic molecule
Emp. Form.:
C18H24N4O
Mol. Mass.:
312.4094
SMILES:
Cc1cccc2c(nn(C)c12)C(C)(C)NC(=O)[C@@H]1[C@H]2CNC[C@@H]12
: