Target
Indoleamine 2,3-dioxygenase 1
Ligand
BDBM222999
Substrate
Meas. Tech.
Enzyme Assay
IC50
<200±n/a nM
Citation
 Combs, APYue, EWSparks, RBZhu, W 1,2,5-oxadiazoles as inhibitors of indoleamine 2,3-dioxygenase US Patent  US9789094 Publication Date 10/17/2017 
Target
Name:
Indoleamine 2,3-dioxygenase 1
Synonyms:
I23O1_HUMAN IDO-1 INDO Indoleamine 2,3-dioxygenase | Indoleamine-pyrrole 2,3-dioxygenase
Type:
Enzyme
Mol. Mass.:
45330.80
Organism:
Homo sapiens (Human)
Description:
P14902
Residue:
403
  
Inhibitor
Name:
BDBM222999
Synonyms:
US10034864, Example 1 US11207302, Example 1 US9789094, 1
Type:
Small organic molecule
Emp. Form.:
C11H13BrFN7O4S
Mol. Mass.:
438.233
SMILES:
NS(=O)(=O)NCCNc1nonc1C(Nc1ccc(F)c(Br)c1)=NO
: