Target
Proto-oncogene tyrosine-protein kinase receptor Ret [658-1114]
Ligand
BDBM347344
Substrate
Meas. Tech.
Enzymatic Assay
IC50
<100±n/a nM
Citation
 Eidam, HS Compounds as rearranged during transfection (RET) inhibitors US Patent  US9789100 Publication Date 10/17/2017 
Target
Name:
Proto-oncogene tyrosine-protein kinase receptor Ret [658-1114]
Synonyms:
CDHF12 PTC Proto-oncogene tyrosine-protein kinase receptor Ret (aa 658-1114) RET Kinase (aa 658-1114) RET_HUMAN
Type:
Mol. Mass.:
51535.16
Organism:
Homo sapiens (Human)
Description:
P07949[658-1114]
Residue:
457
  
Inhibitor
Name:
BDBM347344
Synonyms:
2-(4-(4-Ethoxy-6-oxo-1,6-dihydropyridin-3-yl)-3-fluorophenyl)-N-(4-(3-hydroxy-2,2-dimethylpropyl)-3-(trifluoromethyl)phenyl)acetamide | US9789100, Example 32
Type:
Small organic molecule
Emp. Form.:
C27H28F4N2O4
Mol. Mass.:
520.5158
SMILES:
CCOc1cc(=O)[nH]cc1-c1ccc(CC(=O)Nc2ccc(CC(C)(C)CO)c(c2)C(F)(F)F)cc1F
: