Target
Carbonic anhydrase 2
Ligand
BDBM15224
Substrate
BDBM10856
Meas. Tech.
CA Inhibition Assay
pH
7.5±n/a
Temperature
298.15±n/a K
Ki
6.8±n/a nM
Citation
 Wilkinson, BLBornaghi, LFHouston, TAInnocenti, AVullo, DSupuran, CTPoulsen, SA Carbonic anhydrase inhibitors: inhibition of isozymes I, II, and IX with triazole-linked O-glycosides of benzene sulfonamides. J Med Chem 50:1651-7 (2007)  
Target
Name:
Carbonic anhydrase 2
Synonyms:
CA-II CAC Carbonate dehydratase II Carbonic anhydrase 2 (CA-II) Carbonic anhydrase C Carbonic anhydrase II (CA-II) Carbonic anhydrase II (hCA II) | Carbonic anhydrase isoenzyme II (hCA II)
Type:
Enzyme
Mol. Mass.:
29250.71
Organism:
Homo sapiens (Human)
Description:
P00918
Residue:
260
  
Inhibitor
Name:
BDBM15224
Synonyms:
4-(4-{[(2,3,4,6-tetra-O-acetyl-beta-D-galactopyranosyl)oxy]methyl}-1H-1,2,3-triazol-1-yl)benzenesulfonamide [(2R,3S,4S,5R,6R)-3,4,5-tris(acetyloxy)-6-{[1-(4-sulfamoylphenyl)-1H-1,2,3-triazol-4-yl]methoxy}oxan-2-yl]methyl acetate | glycoconjugate sulfonamide 8
Type:
Small organic molecule
Emp. Form.:
C23H28N4O12S
Mol. Mass.:
584.553
SMILES:
CC(=O)OC[C@H]1O[C@@H](OCc2cn(nn2)-c2ccc(cc2)S(N)(=O)=O)[C@H](OC(C)=O)[C@@H](OC(C)=O)[C@H]1OC(C)=O
:
Substrate
Name:
BDBM10856
Synonyms:
Carbon Dioxide | methanedione
Type:
Small organic molecule
Emp. Form.:
CO2
Mol. Mass.:
44.0095
SMILES:
O=C=O
: