Target
Carbonic anhydrase 9
Ligand
BDBM10885
Substrate
BDBM10856
Meas. Tech.
CA Inhibition Assay
Ki
42±n/a nM
Citation
 Wilkinson, BLBornaghi, LFHouston, TAInnocenti, AVullo, DSupuran, CTPoulsen, SA Carbonic anhydrase inhibitors: inhibition of isozymes I, II, and IX with triazole-linked O-glycosides of benzene sulfonamides. J Med Chem 50:1651-7 (2007)  
Target
Name:
Carbonic anhydrase 9
Synonyms:
CA-IX CAH9_HUMAN Carbonic anhydrase 9 (CA IX) Carbonic anhydrase 9 precursor Carbonic anhydrase IX (CAIX) Carbonic anhydrases; II & IX MN RCC-associated antigen G250
Type:
Enzyme
Mol. Mass.:
49669.03
Organism:
Homo sapiens (Human)
Description:
Catalytic domain of human cloned isozyme was used in the assay
Residue:
459
  
Inhibitor
Name:
BDBM10885
Synonyms:
(4R)-4-(ethylamino)-2-(3-methoxypropyl)-1,1-dioxo-2H,3H,4H-1,7,2-thieno[3,2-e][1,2]thiazine-6-sulfonamide AL-4862 Brinzolamide (BRZ) | brinzolamide
Type:
Small organic molecule
Emp. Form.:
C12H21N3O5S3
Mol. Mass.:
383.507
SMILES:
CCN[C@H]1CN(CCCOC)S(=O)(=O)c2sc(cc12)S(N)(=O)=O
:
Substrate
Name:
BDBM10856
Synonyms:
Carbon Dioxide | methanedione
Type:
Small organic molecule
Emp. Form.:
CO2
Mol. Mass.:
44.0095
SMILES:
O=C=O
: