Target
Carbonic anhydrase 9
Ligand
BDBM15231
Substrate
BDBM10856
Meas. Tech.
CA Inhibition Assay
Ki
69±n/a nM
Citation
 Wilkinson, BLBornaghi, LFHouston, TAInnocenti, AVullo, DSupuran, CTPoulsen, SA Carbonic anhydrase inhibitors: inhibition of isozymes I, II, and IX with triazole-linked O-glycosides of benzene sulfonamides. J Med Chem 50:1651-7 (2007)  
Target
Name:
Carbonic anhydrase 9
Synonyms:
CA-IX CAH9_HUMAN Carbonic anhydrase 9 (CA IX) Carbonic anhydrase 9 precursor Carbonic anhydrase IX (CAIX) Carbonic anhydrases; II & IX MN RCC-associated antigen G250
Type:
Enzyme
Mol. Mass.:
49669.03
Organism:
Homo sapiens (Human)
Description:
Catalytic domain of human cloned isozyme was used in the assay
Residue:
459
  
Inhibitor
Name:
BDBM15231
Synonyms:
4-[4-({[(2R,3R,4S,5R)-3,4-dihydroxy-5-(hydroxymethyl)oxolan-2-yl]oxy}methyl)-1H-1,2,3-triazol-1-yl]benzene-1-sulfonamide glycoconjugate sulfonamide 15
Type:
Small organic molecule
Emp. Form.:
C14H18N4O7S
Mol. Mass.:
386.38
SMILES:
NS(=O)(=O)c1ccc(cc1)-n1cc(CO[C@@H]2O[C@H](CO)[C@@H](O)[C@H]2O)nn1
:
Substrate
Name:
BDBM10856
Synonyms:
Carbon Dioxide | methanedione
Type:
Small organic molecule
Emp. Form.:
CO2
Mol. Mass.:
44.0095
SMILES:
O=C=O
: