Target
Mitogen-activated protein kinase 14
Ligand
BDBM15428
Substrate
biotinylated GST-ATF2
Meas. Tech.
Enzyme Inhibition Assay
pH
7.2±n/a
Temperature
303.15±n/a K
IC50
680±n/a nM
Citation
 Dombroski, MALetavic, MAMcClure, KFBarberia, JTCarty, TJCortina, SRCsiki, CDipesa, AJElliott, NCGabel, CAJordan, CKLabasi, JMMartin, WHPeese, KMStock, IASvensson, LSweeney, FJYu, CH Benzimidazolone p38 inhibitors. Bioorg Med Chem Lett 14:919-23 (2004)  
Target
Name:
Mitogen-activated protein kinase 14
Synonyms:
CSAID-binding protein CSBP1 CSPB1 MAP kinase 14 MAP kinase p38 alpha MAPK14 MK14_HUMAN Mitogen-activated protein kinase p38 alpha Stress-activated protein kinase 2a | p38 MAP kinase alpha/beta
Type:
Serine/threonine-protein kinase
Mol. Mass.:
41286.76
Organism:
Homo sapiens (Human)
Description:
Q16539
Residue:
360
  
Inhibitor
Name:
BDBM15428
Synonyms:
5-[4-(4-chlorophenyl)-2-(thiophen-2-yl)-1H-imidazol-5-yl]-1,3-dimethyl-2,3-dihydro-1H-1,3-benzodiazol-2-one | benzimidazolone 12n
Type:
Small organic molecule
Emp. Form.:
C22H17ClN4OS
Mol. Mass.:
420.915
SMILES:
Cn1c2ccc(cc2n(C)c1=O)-c1nc([nH]c1-c1ccc(Cl)cc1)-c1cccs1
:
Substrate
Name:
biotinylated GST-ATF2
Synonyms:
ATF-2-GST Activating transcription factor 2 GST-ATF2 biotinylated activating transcription factor 2
Type:
Other Protein Type
Mol. Mass.:
12237.77
Organism:
Homo sapiens (Human)
Description:
Residue:
109