Target
Mitogen-activated protein kinase 14
Ligand
BDBM15441
Substrate
biotinylated GST-ATF2
Meas. Tech.
Enzyme Inhibition Assay
IC50
>1000±n/a nM
Citation
 Dombroski, MALetavic, MAMcClure, KFBarberia, JTCarty, TJCortina, SRCsiki, CDipesa, AJElliott, NCGabel, CAJordan, CKLabasi, JMMartin, WHPeese, KMStock, IASvensson, LSweeney, FJYu, CH Benzimidazolone p38 inhibitors. Bioorg Med Chem Lett 14:919-23 (2004)  
Target
Name:
Mitogen-activated protein kinase 14
Synonyms:
CSAID-binding protein CSBP1 CSPB1 MAP kinase 14 MAP kinase p38 alpha MAPK14 MK14_HUMAN Mitogen-activated protein kinase p38 alpha Stress-activated protein kinase 2a | p38 MAP kinase alpha/beta
Type:
Serine/threonine-protein kinase
Mol. Mass.:
41286.76
Organism:
Homo sapiens (Human)
Description:
Q16539
Residue:
360
  
Inhibitor
Name:
BDBM15441
Synonyms:
1,3-diethyl-5-[2-(3-methylphenyl)-5-(pyridin-3-yl)-1H-pyrrol-3-yl]-2,3-dihydro-1H-1,3-benzodiazol-2-one | benzimidazolone 26
Type:
Small organic molecule
Emp. Form.:
C27H26N4O
Mol. Mass.:
422.5215
SMILES:
CCn1c2ccc(cc2n(CC)c1=O)-c1cc([nH]c1-c1cccc(C)c1)-c1cccnc1
:
Substrate
Name:
biotinylated GST-ATF2
Synonyms:
ATF-2-GST Activating transcription factor 2 GST-ATF2 biotinylated activating transcription factor 2
Type:
Other Protein Type
Mol. Mass.:
12237.77
Organism:
Homo sapiens (Human)
Description:
Residue:
109