Target
Cytochrome P450 11B1, mitochondrial
Ligand
BDBM347716
Substrate
Meas. Tech.
Inhibition Assay
EC50
1.16±n/a nM
Citation
 Aebi, JAmrein, KHornsperger, BKuhn, BLi, DLiu, YMaerki, HPMartin, REMayweg, AVTan, XWang, LWu, J Pyridinyloxy- and phenyloxy-pyrazolyl compounds US Patent  US9790217 Publication Date 10/17/2017 
Target
Name:
Cytochrome P450 11B1, mitochondrial
Synonyms:
C11B1_HUMAN CYPXIB1 Cytochrome P450 11B1 Cytochrome P450 11B1, mitochondrial | S11BH
Type:
Enzyme
Mol. Mass.:
57591.44
Organism:
Homo sapiens (Human)
Description:
P15538
Residue:
503
  
Inhibitor
Name:
BDBM347716
Synonyms:
Ethyl 2-[(Z)-2-(4-cyanophenoxy)-3- (dimethylamino)prop-2-enoyl]benzoate US9790217, 40
Type:
Small organic molecule
Emp. Form.:
C21H20N2O4
Mol. Mass.:
364.3945
SMILES:
CCOC(=O)c1ccccc1C(=O)C(\Oc1ccc(cc1)C#N)=C\N(C)C
: