Target
Interleukin-1 receptor-associated kinase 1 [194-712]
Ligand
BDBM347812
Substrate
Meas. Tech.
Enzymatic Assay
IC50
>5000±n/a nM
Citation
 Jorand-Lebrun, CJones, RWon, ACNguyen, NJohnson, TLDeselm, LCPanda, K Heteroaryl compounds as IRAK inhibitors and uses thereof US Patent  US9790221 Publication Date 10/17/2017 
Target
Name:
Interleukin-1 receptor-associated kinase 1 [194-712]
Synonyms:
IRAK IRAK1_HUMAN | Interleukin-1 receptor-associated kinase 1 (IRAK1)
Type:
Enzyme Catalytic Domain
Mol. Mass.:
55943.99
Organism:
Homo sapiens (Human)
Description:
aa 194-712
Residue:
519
  
Inhibitor
Name:
BDBM347812
Synonyms:
US9790221, Compound 18
Type:
Small organic molecule
Emp. Form.:
C23H24N8O2S
Mol. Mass.:
476.554
SMILES:
COC(=O)c1nnc(s1)-c1cnc(nc1NC1CCCNC1)-c1cccc(c1)-c1cnn(C)c1
: