Target
Interleukin-1 receptor-associated kinase 4
Ligand
BDBM347812
Substrate
Meas. Tech.
Enzymatic Assay
IC50
<100±n/a nM
Citation
 Jorand-Lebrun, CJones, RWon, ACNguyen, NJohnson, TLDeselm, LCPanda, K Heteroaryl compounds as IRAK inhibitors and uses thereof US Patent  US9790221 Publication Date 10/17/2017 
Target
Name:
Interleukin-1 receptor-associated kinase 4
Synonyms:
IRAK-4 IRAK4_HUMAN Interleukin-1 receptor-associated kinase 4 (IRAK4) | Renal carcinoma antigen NY-REN-64
Type:
Protein
Mol. Mass.:
51519.08
Organism:
Homo sapiens (Human)
Description:
Q9NWZ3
Residue:
460
  
Inhibitor
Name:
BDBM347812
Synonyms:
US9790221, Compound 18
Type:
Small organic molecule
Emp. Form.:
C23H24N8O2S
Mol. Mass.:
476.554
SMILES:
COC(=O)c1nnc(s1)-c1cnc(nc1NC1CCCNC1)-c1cccc(c1)-c1cnn(C)c1
: