Target
Trace amine-associated receptor 1
Ligand
BDBM348706
Substrate
Meas. Tech.
Radioligand Binding Assay
IC50
17.9±n/a nM
Citation
 Cecere, GGalley, GHu, YNorcross, RPflieger, PShen, H 2-oxa-5-azabicyclo[2.2.1]heptan-3-yl derivatives US Patent  US9790230 Publication Date 10/17/2017 
Target
Name:
Trace amine-associated receptor 1
Synonyms:
TAAR1_RAT Taar1 Trace amine receptor 1 (TARR1) Trace amine-associated receptor 1 (TAAR1) Trar1
Type:
Enzyme
Mol. Mass.:
38034.73
Organism:
Rattus norvegicus (Rat)
Description:
Q923Y9
Residue:
332
  
Inhibitor
Name:
BDBM348706
Synonyms:
4-Chloro-N-[4-[(1R,3S,4R)-2-oxa-5-azabicyclo[2.2.1]heptan-3-yl]phenyl]-3-propyl-1H-pyrazole-5-carboxamide | US9790230, Example 68
Type:
Small organic molecule
Emp. Form.:
C18H23ClN4O2
Mol. Mass.:
362.854
SMILES:
CCCC(=N)C(\Cl)=C(/N)C(=O)Nc1ccc(cc1)[C@@H]1O[C@H]2CN[C@@H]1C2
: