Target
Dipeptidyl peptidase 4
Ligand
BDBM15573
Substrate
BDBM11057
Meas. Tech.
Dipeptidyl Peptidase Inhibition Assay
pH
7.5±n/a
Temperature
310.15±n/a K
IC50
1247±n/a nM
Citation
 Adam, GCMeng, JAthanasopoulos, JZhang, XChapman, KT Affinity-based ranking of ligands for DPP-4 from mixtures. Bioorg Med Chem Lett 17:2404-7 (2007)  
Target
Name:
Dipeptidyl peptidase 4
Synonyms:
ADABP Adenosine deaminase complexing protein 2 CD_antigen=CD26 DPP4 DPPIV Dipeptidyl peptidase 4 (DPP IV) Dipeptidyl peptidase 4 (DPP4) Dipeptidyl peptidase 4 membrane form Dipeptidyl peptidase IV Dipeptidyl peptidase IV (DDP-IV) Dipeptidyl peptidase IV membrane form Dipeptidyl peptidase-IV (DPP-4) T-cell activation antigen CD26 | TP103
Type:
Enzyme
Mol. Mass.:
88271.01
Organism:
Homo sapiens (Human)
Description:
P27487
Residue:
766
  
Inhibitor
Name:
BDBM15573
Synonyms:
(3R)-3-amino-1-[4-(4-chlorophenyl)piperazin-1-yl]-4-(2-fluorophenyl)butan-1-one | DPP-4 ligand 15
Type:
Small organic molecule
Emp. Form.:
C20H23ClFN3O
Mol. Mass.:
375.868
SMILES:
N[C@@H](CC(=O)N1CCN(CC1)c1ccc(Cl)cc1)Cc1ccccc1F
:
Substrate
Name:
BDBM11057
Synonyms:
1-(2-aminoacetyl)-N-(4-methyl-2-oxo-2H-chromen-7-yl)pyrrolidine-2-carboxamide hydrobromide Gly-Pro-7-amidomethylcoumarin | Gly-Pro-AMC
Type:
Small organic molecule
Emp. Form.:
C17H19N3O4
Mol. Mass.:
329.3505
SMILES:
Cc1cc(=O)oc2cc(NC(=O)C3CCCN3C(=O)CN)ccc12
: