Target
Sentrin-specific protease 7
Ligand
BDBM348889
Substrate
Meas. Tech.
Binding Assay
IC50
1900±2200 nM
Citation
 Chen, Y Methods of identifying SENP1 inhibitors US Patent  US9791447 Publication Date 10/17/2017 
Target
Name:
Sentrin-specific protease 7
Synonyms:
KIAA1707 SENP7_HUMAN SUSP2 | Sentrin-specific protease 7 (SENP7)
Type:
Protein
Mol. Mass.:
119657.39
Organism:
Homo sapiens (Human)
Description:
Q9BQF6
Residue:
1050
  
Inhibitor
Name:
BDBM348889
Synonyms:
NSC58046 | US9791447, Compound SPI-07
Type:
Small organic molecule
Emp. Form.:
C17H14N3O6S2
Mol. Mass.:
420.44
SMILES:
Cc1cc(N)ccc1\N=N\c1cc(c2cccc(c2c1)S([O-])(=O)=O)S(O)(=O)=O
: